Changeset 5018ad4 in subsurface


Ignore:
Timestamp:
Feb 6, 2017, 10:25:53 PM (7 weeks ago)
Author:
Dirk Hohndel <dirk@…>
Branches:
master
Children:
b912880
Parents:
2bad9bd
Message:

On Travis, don't run TestPreferences?

... because that one needs a display to run.

Signed-off-by: Dirk Hohndel <dirk@…>

Files:
2 edited

Legend:

Unmodified
Added
Removed
  • .travis.yml

    r2bad9bd r5018ad4  
    4444      cd .. ;
    4545      bash -e ./subsurface/scripts/build.sh
    46     - cd subsurface/build ; env CTEST_OUTPUT_ON_FAILURE=1 make check
     46    - cd subsurface/build ; env CTEST_OUTPUT_ON_FAILURE=1 make check_travis
    4747#    - cd subsurface/build-mobile ; env CTEST_OUTPUT_ON_FAILURE=1 make check
  • tests/CMakeLists.txt

    r3dce5de r5018ad4  
    3434        TestRenumber
    3535)
     36
     37add_custom_target(check_travis COMMAND ${CMAKE_CTEST_COMMAND}
     38        DEPENDS
     39        TestUnitConversion
     40        TestProfile
     41        TestGpsCoords
     42        TestParse
     43        TestGitStorage
     44        TestPlan
     45        TestDiveSiteDuplication
     46        TestRenumber
     47)
Note: See TracChangeset for help on using the changeset viewer.